jenkins+mvn+testng 报错

pom.xml
配置如下,本地按照这个配置之后不报这个错误了,一上jenkins就报错…我该怎么处理呢。。:

<aspectj.version>1.8.10</aspectj.version>
<project.build.sourceEncoding>UTF-8</project.build.sourceEncoding>

报错如下:
[ERROR] COMPILATION ERROR :
[INFO] -------------------------------------------------------------
[ERROR] /root/.jenkins/workspace/aliyun-1.9/src/test/java/test/PGSQLUtil.java:[44,53] -source 1.5 中不支持 diamond 运算符
(请使用 -source 7 或更高版本以启用 diamond 运算符)
[ERROR] /root/.jenkins/workspace/aliyun-1.9/src/test/java/testCase/ModifyTaskTest.java:[125,60] -source 1.5 中不支持 diamond 运算符
(请使用 -source 7 或更高版本以启用 diamond 运算符)
[ERROR] /root/.jenkins/workspace/aliyun-1.9/src/test/java/util/DataBase.java:[42,45] -source 1.5 中不支持 diamond 运算符
(请使用 -source 7 或更高版本以启用 diamond 运算符)
[ERROR] /root/.jenkins/workspace/aliyun-1.9/src/test/java/testCase/DisableMccTaskTest.java:[129,60] -source 1.5 中不支持 diamond 运算符
(请使用 -source 7 或更高版本以启用 diamond 运算符)
[ERROR] /root/.jenkins/workspace/aliyun-1.9/src/test/java/testCase/DeleteTaskTest.java:[102,60] -source 1.5 中不支持 diamond 运算符
(请使用 -source 7 或更高版本以启用 diamond 运算符)
[ERROR] /root/.jenkins/workspace/aliyun-1.9/src/test/java/test/Post1.java:[108,48] -source 1.5 中不支持 diamond 运算符
(请使用 -source 7 或更高版本以启用 diamond 运算符)
[ERROR] /root/.jenkins/workspace/aliyun-1.9/src/test/java/test/CreateTaskTest111.java:[66,52] -source 1.5 中不支持 diamond 运算符
(请使用 -source 7 或更高版本以启用 diamond 运算符)
[ERROR] /root/.jenkins/workspace/aliyun-1.9/src/test/java/testCase/DisableMffTaskTest.java:[130,60] -source 1.5 中不支持 diamond 运算符
(请使用 -source 7 或更高版本以启用 diamond 运算符)
[ERROR] /root/.jenkins/workspace/aliyun-1.9/src/test/java/testCase/CreateTaskTest.java:[80,56] -source 1.5 中不支持 diamond 运算符
(请使用 -source 7 或更高版本以启用 diamond 运算符)
[ERROR] /root/.jenkins/workspace/aliyun-1.9/src/test/java/testCase/QueryTaskTest.java:[90,56] -source 1.5 中不支持 diamond 运算符
(请使用 -source 7 或更高版本以启用 diamond 运算符)
[INFO] 10 errors
[INFO] -------------------------------------------------------------
[INFO] ------------------------------------------------------------------------
[INFO] BUILD FAILURE
[INFO] ------------------------------------------------------------------------
[INFO] Total time: 4.638 s
[INFO] Finished at: 2021-11-15T18:53:47+08:00
[INFO] ------------------------------------------------------------------------
Waiting for Jenkins to finish collecting data
[ERROR] Failed to execute goal org.apache.maven.plugins:maven-compiler-plugin:3.1:testCompile (default-testCompile) on project InterfaceTest: Compilation failure: Compilation failure:
[ERROR] /root/.jenkins/workspace/aliyun-1.9/src/test/java/test/PGSQLUtil.java:[44,53] -source 1.5 中不支持 diamond 运算符
[ERROR] (请使用 -source 7 或更高版本以启用 diamond 运算符)
[ERROR] /root/.jenkins/workspace/aliyun-1.9/src/test/java/testCase/ModifyTaskTest.java:[125,60] -source 1.5 中不支持 diamond 运算符
[ERROR] (请使用 -source 7 或更高版本以启用 diamond 运算符)
[ERROR] /root/.jenkins/workspace/aliyun-1.9/src/test/java/util/DataBase.java:[42,45] -source 1.5 中不支持 diamond 运算符
[ERROR] (请使用 -source 7 或更高版本以启用 diamond 运算符)
[ERROR] /root/.jenkins/workspace/aliyun-1.9/src/test/java/testCase/DisableMccTaskTest.java:[129,60] -source 1.5 中不支持 diamond 运算符
[ERROR] (请使用 -source 7 或更高版本以启用 diamond 运算符)
[ERROR] /root/.jenkins/workspace/aliyun-1.9/src/test/java/testCase/DeleteTaskTest.java:[102,60] -source 1.5 中不支持 diamond 运算符
[ERROR] (请使用 -source 7 或更高版本以启用 diamond 运算符)
[ERROR] /root/.jenkins/workspace/aliyun-1.9/src/test/java/test/Post1.java:[108,48] -source 1.5 中不支持 diamond 运算符
[ERROR] (请使用 -source 7 或更高版本以启用 diamond 运算符)
[ERROR] /root/.jenkins/workspace/aliyun-1.9/src/test/java/test/CreateTaskTest111.java:[66,52] -source 1.5 中不支持 diamond 运算符
[ERROR] (请使用 -source 7 或更高版本以启用 diamond 运算符)
[ERROR] /root/.jenkins/workspace/aliyun-1.9/src/test/java/testCase/DisableMffTaskTest.java:[130,60] -source 1.5 中不支持 diamond 运算符
[ERROR] (请使用 -source 7 或更高版本以启用 diamond 运算符)
[ERROR] /root/.jenkins/workspace/aliyun-1.9/src/test/java/testCase/CreateTaskTest.java:[80,56] -source 1.5 中不支持 diamond 运算符
[ERROR] (请使用 -source 7 或更高版本以启用 diamond 运算符)
[ERROR] /root/.jenkins/workspace/aliyun-1.9/src/test/java/testCase/QueryTaskTest.java:[90,56] -source 1.5 中不支持 diamond 运算符
[ERROR] (请使用 -source 7 或更高版本以启用 diamond 运算符)
[ERROR] → [Help 1]
[ERROR]
[ERROR] To see the full stack trace of the errors, re-run Maven with the -e switch.
[ERROR] Re-run Maven using the -X switch to enable full debug logging.
[ERROR]
[ERROR] For more information about the errors and possible solutions, please read the following articles:
[ERROR] [Help 1] MojoFailureException - Apache Maven - Apache Software Foundation
[JENKINS] Archiving /root/.jenkins/workspace/aliyun-1.9/pom.xml to org.example/InterfaceTest/1.0-SNAPSHOT/InterfaceTest-1.0-SNAPSHOT.pom
[aliyun-1.9] $ /bin/bash /data/br/base/apache-tomcat-8.5.71/temp/jenkins7349595780042185372.sh
channel stopped

关闭